OpenJDK bugs & OpenJDK known Issues :

OpenJDK Developers Guide

All known and fixed OpenJDK Bugs, consolidated. Please refer https://bugs.openjdk.java.net/ for details.


OpenJDK Bug



BugJDK-8138744 libdbgwrapper80.so library dependency issue on AIX

View Bug Details




OpenJDK Bug



BugJDK-6533331 Java Installer fails to update/register CurrentVersion and BrowserJavaVersion correctly

View Bug Details




OpenJDK Bug



BugJDK-5109276 Java Update fails if Windows patch is not installed.

View Bug Details




OpenJDK Bug



BugDescription: BugJDK-4235948 Installation of Java Plug-in 1.1.2_001 causes jre command to fail JDK-7053999 Upgrading from 6u25 with modified java.security file fails, breaks installation

View Bug Details




OpenJDK Bug



BugJDK-4337686 Java Plugin 1.3 installer fails during automatic download

View Bug Details




OpenJDK Bug



BugJDK-6764967 Java JRE 1.6u10 installer failed with error 1606 when using "/qb!" switchm

View Bug Details




OpenJDK Bug



BugJDK-8208379 compiler/jvmci/events/JvmciNotifyInstallEventTest.java failed with "Got unexpected event count after 2nd install attempt: expected 9 to equal 2"

View Bug Details




OpenJDK Bug



BugDescription: BugJDK-4170928 Installation fails with the latest build of Java Plugin1.1.2 on Windows95/98/NT. JDK-4158461 Installer fails when installing Java Plug-in 1.1.1 over 1.1 in Win95

View Bug Details




OpenJDK Bug



BackportJDK-2026902 Installation of Java Plug-in 1.1.2_001 causes jre command to fail

View Bug Details




OpenJDK Bug



BackportJDK-8175637 [JVMCI] JVMCI initialization with SecurityManager installed fails: java.security.AccessControlException: access denied

View Bug Details




OpenJDK Bug



BugJDK-8145337 [JVMCI] JVMCI initialization with SecurityManager installed fails: java.security.AccessControlException: access denied

View Bug Details




OpenJDK Bug



BugDescription: BackportJDK-4031163 Java Workshop 1.0 Build Manager fails if JIT installed. JDK-2216369 Upgrading from 6u25 with modified java.security file fails, breaks installation

View Bug Details




OpenJDK Bug



BackportJDK-2210638 Upgrading from 6u25 with modified java.security file fails, breaks installation

View Bug Details




OpenJDK Bug



BackportJDK-2199021 Java Installer fails to update/register CurrentVersion and BrowserJavaVersion correctly

View Bug Details




OpenJDK Bug



BugJDK-4633680 Installer fails to copy 1.4 java.exe into win systems folder when 1.3 is present

View Bug Details




OpenJDK Bug



BackportDescription: BackportJDK-8226024 compiler/jvmci/events/JvmciNotifyInstallEventTest.java failed with "Got unexpected event count after 2nd install attempt: expected 9 to equal 2" JDK-8235232 compiler/jvmci/events/JvmciNotifyInstallEventTest.java failed with "Got unexpected event count after 2nd install attempt: expected 9 to equal 2"

View Bug Details




OpenJDK Bug



BackportJDK-8234498 compiler/jvmci/events/JvmciNotifyInstallEventTest.java failed with "Got unexpected event count after 2nd install attempt: expected 9 to equal 2"

View Bug Details




OpenJDK Bug



BugJDK-4955508 TEST BUG: regression test com/sun/jdi/Java_gTest.java fails on Windows

View Bug Details




OpenJDK Bug



BugJDK-8050838 JRE Install Error in localized Windows 8.1 after join in AD domain

View Bug Details




OpenJDK Bug



BugDescription: BugJDK-6747473 REGRESSION:Installing 64bit JDK, an error message shows when begin the JRE installer JDK-6675949 [WAT] install fails trying to display Close Applications dialog (FilesInUse) on Vista

View Bug Details




OpenJDK Bug



BugJDK-4900326 PIT : J2RE/J2SDK Installation fails on Windows 98 SE

View Bug Details




OpenJDK Bug



BugJDK-6917120 Both SE and J4B 6u18 full builds failed with "Core Build FAILED" after latest PLUS build putback

View Bug Details




OpenJDK Bug



BugJDK-4725211 TEST_BUG: REG-TESTS: javax/sound/midi/Devices/MidiIO.java is invalid

View Bug Details




OpenJDK Bug



BugDescription: BugJDK-4953793 J2SDK 1.4.2_01, 1.4.2_02 fail to install (JVM currently running) on W2000 SP4 JDK-8211012 [Linux] JDK 11, warning when uninstall rpm package "warning: %postun(jdk-11-2000:11-ga.x86_64) scriptlet failed, exit status 2

View Bug Details




OpenJDK Bug



BugJDK-8153391 an image created for "jdk.compiler" fails to run javac

View Bug Details




OpenJDK Bug



EnhancementJDK-6502548 test/Makefile needs to be setup to allow for JPRT testrules (NSK and JCK testing too?)

View Bug Details




OpenJDK Bug



BugJDK-8187220 postinstall fails if there is a space in user name

View Bug Details




OpenJDK Bug



BugDescription: BugJDK-8167063 spurious message "A JNI error has occurred" if start-class cannot be initialized JDK-4262747 Hotspot 2.0:Beta:Build A : Few API tests crashed on Win 95 with Xmixed

View Bug Details




OpenJDK Bug



BugJDK-6651974 JQS reports error messages during uninstall

View Bug Details




OpenJDK Bug



BugJDK-8075409 jre8-40 fails to install on SuSE 11.3

View Bug Details




OpenJDK Bug



BugJDK-8242168 ClhsdbFindPC.java failed due to "RuntimeException: 'In code in NMethod for LingeredAppWithTrivialMain.main' missing from stdout/stderr"

View Bug Details




OpenJDK Bug



BugDescription: BugJDK-4871733 RegTest-test com/sun/jdi/Java_gTest.java fails JDK-4776466 CertificateFactory.generateCertificate(InputStream) accepts defective certificat

View Bug Details




OpenJDK Bug



BugJDK-6355791 JCK14a - api TimeZone static test fails for 142_11b1 on Windows 32bit jvm "returns wrong offset"

View Bug Details




OpenJDK Bug



BugJDK-8023347 The case index_AddRemove failed automatically with JDK7u45b06

View Bug Details




OpenJDK Bug



BugJDK-8148167 jdk 8u71 fails to install with no error message

View Bug Details




OpenJDK Bug



BugDescription: BugJDK-4209769 Build_D,-Xcomp,Win95, JCK Test failures JDK-8172444 Javapackager throws NullPointerException for simple CLI hello world test case

View Bug Details




OpenJDK Bug



BugJDK-8158501 [macosx] The checkbox can't be checked via an event generate on the menu.

View Bug Details




OpenJDK Bug



BugJDK-8165721 jmods folder is not auto discovered

View Bug Details




OpenJDK Bug



BugJDK-5027275 TEST_BUG: 30 java/rmi regression tests fail on Windows 98

View Bug Details




OpenJDK Bug



BugDescription: BugJDK-4114883 JAVAX: Regression: URLClassLoader fails to find resources in all cases. JDK-8161986 Selecting 32/64 bit resources failed if user has installed both jre's

View Bug Details




OpenJDK Bug



BugJDK-4445172 Linux: Fatal: JVM can not locate libpthread.so!

View Bug Details




OpenJDK Bug



BugJDK-6221549 TCK-jnlp 1.5: jnlp_file/resources/j2se/index.html#vmArgs hang in some cases.

View Bug Details




OpenJDK Bug



BugJDK-4504389 Optional Package Native Installation doesnot work on IE

View Bug Details




OpenJDK Bug



BugDescription: BugJDK-4451889 java 1.4.0-beta-b61/b63 core dump on x86 and sparc during Solaris 9 CD0 install JDK-8133191 NVDA screen reader and JAWS can't read the "Look and Feel" Selections.

View Bug Details




OpenJDK Bug



BugJDK-8095431 [Bundlers] ant bundling fails with NPE when using file associations

View Bug Details




OpenJDK Bug



BugJDK-8189783 Java Web Start application with file extension association is removed from cache when invoked for the second time from browser

View Bug Details




OpenJDK Bug



TaskJDK-8079141 Investigate deploy registration problems after enabling\disabling Java Content in the browser

View Bug Details




OpenJDK Bug



BugDescription: BugJDK-4302483 SSLException occurs in URLReaderWithOptions example program JDK-5034810 IFTW bundles fail to install on Win98 Second Edition

View Bug Details




OpenJDK Bug



BugJDK-6262486 COMPATIBILITY: jagex_com - Monkey Puzzle applet fails to load

View Bug Details




OpenJDK Bug



BugJDK-6348640 Installer testing for wrong return value from GetExitCodeProcess

View Bug Details




OpenJDK Bug



BugJDK-4149728 JDK 1.2 beta4 does not install the plugin correctly

View Bug Details




OpenJDK Bug



BugDescription: BugJDK-7044885 JavaFX Control Panel does not work JDK-4482236 jdk win32 install sometimes fails if free disk space is tight

View Bug Details




OpenJDK Bug



BugJDK-6634510 Patch in Place fails after installing 6u10 kernel

View Bug Details




OpenJDK Bug



BugJDK-6356475 REGRESSION:"java -X" from cmdline fails

View Bug Details




OpenJDK Bug



BugJDK-8158066 SourceDebugExtensionTest fails to rename file

View Bug Details




OpenJDK Bug



BugDescription: BackportJDK-8147444 compiler/jsr292/NonInlinedCall/RedefineTest.java fails with NullPointerException in ClassFileInstaller JDK-8000627 Webstart failed to run with applet-desc and with no-caching

View Bug Details




OpenJDK Bug



BugJDK-7197892 Webstart failed to run with applet-desc and with no-caching

View Bug Details




OpenJDK Bug



EnhancementJDK-8210274 Source Launcher should work with a security manager

View Bug Details




OpenJDK Bug



BugJDK-8079360 AttachProviderImpl could not be instantiated

View Bug Details




OpenJDK Bug



BugDescription: BugJDK-6908502 deployJava.installLatestJRE() does not work sometimes - download problems JDK-4701347 Postinstall script fails for SUNWj3rt & SUNWj3dev packages.

View Bug Details




OpenJDK Bug



BugJDK-6258153 Regression test LocaleFamilyNames.java fails on WinXP with Mustang

View Bug Details




OpenJDK Bug



BugJDK-4834070 J2RE (first time) installation fails on Win2003 EE

View Bug Details




OpenJDK Bug



BugJDK-8036756 5u65b09 windows jdk installer fails with internal error:2705

View Bug Details




OpenJDK Bug



EnhancementDescription: BugJDK-4503105 RFE: Windows Executable (Setup) of WebStart 1.0.1_01 is not signed JDK-6960126 With GTK L&F JDesktopPane substitutes set desktop manager

View Bug Details




OpenJDK Bug



BugJDK-6639344 Getting installation errors when choosing not to install demos and samples on 6u4-b10

View Bug Details




OpenJDK Bug



BugJDK-6713144 PIT:Double entries in Java Cache Viewer/Applications for javaws -import install_demo.jnlp

View Bug Details




OpenJDK Bug



BugJDK-4262731 Hotspot 2.0:Beta:Build A : 2 net tests failed on Win NT

View Bug Details




OpenJDK Bug



BugDescription: BugJDK-8029851 Beginning w/ 6u65, signed oracle applet is refused to run with security warning. JDK-5020165 Testing of iftw installation through direct connection is not possible

View Bug Details




OpenJDK Bug



BugJDK-4409877 Linux install script fails on install into path which contains spaces

View Bug Details




OpenJDK Bug



EnhancementJDK-4431060 Installer quits when run as restricted user in windows 2000

View Bug Details




OpenJDK Bug



BugJDK-6311182 REGRESSION: CTE_REGTEST/Generic/4755476, badfonts.txt is not created, mustang

View Bug Details




OpenJDK Bug



BugDescription: BugJDK-8230294 runtime/cds/appcds/ClassPathAttr.java failed with jar operation failed JDK-6589924 PIT : Unable to change/modify the jdk installation

View Bug Details




OpenJDK Bug



BugJDK-4171606 Not able to install JRE for I build on Win NT, Win 95 with jdk12.exe

View Bug Details




OpenJDK Bug



BugJDK-4633164 trailing '\' in Windows installation directory breaks JPI Control Panel

View Bug Details




OpenJDK Bug



BugJDK-8222500 runtime/8176717/TestInheritFD.java failed with java.nio.file.NoSuchFileException: /tmp/communication7071713601211876892.txt

View Bug Details




OpenJDK Bug



BugDescription: BugJDK-8215446 JPackageCreateInstallerInstallDirTest fails on OLE7 JDK-4212721 BasicDirectoryModel fileCache null reference

View Bug Details




OpenJDK Bug



BugJDK-4281250 Beta : Build G : 1 jck test failed with -Xcomp.

View Bug Details




OpenJDK Bug



BugJDK-6340494 CTE_REGTEST/Generic/4904444, test instruction error, mustang

View Bug Details




OpenJDK Bug



BugJDK-4262750 Hotspot 2.0:Beta:Build A : 1 SS test failed on Win NT & 95 with Xmixed

View Bug Details




OpenJDK Bug



BugDescription: BugJDK-8166305 Remove applet code JDK-4049223 JDK does not convert kanji to unicode in system properties

View Bug Details




OpenJDK Bug



BugJDK-4264766 HotSpot 2.0 Beta build A : 3 calendar tests fail with runtime exception.

View Bug Details




OpenJDK Bug



BugJDK-6750054 Java control panel can't be launched in true 64bit JRE on 64bit OS

View Bug Details




OpenJDK Bug



BugDescription: BugJDK-6398636 Vista: JRE 5.0u8 installation failed with 1722 MSI error JDK-4239566 1.3c1 : Build D : java -version causes NullPointer Exception on Win 95

View Bug Details




OpenJDK Bug



BugJDK-8194718 Verification Applet from java.com can not be loaded fine with some exceptions

View Bug Details




OpenJDK Bug



BugJDK-8228434 jdk/net/Sockets/Test.java fails after JDK-8227642

View Bug Details




OpenJDK Bug



BugJDK-8005939 sun/security/x509/{X509CRLImplX509CertImpl}/Verify.java fail in confusing way when some providers not present

View Bug Details




OpenJDK Bug



BugDescription: BugJDK-6354054 Can't create shortcuts on Solaris when application's name have a '#'. JDK-8206258 [Test Error] sun/security/pkcs11 tests fail if NSS libs not found

View Bug Details




OpenJDK Bug



BugJDK-6224405 REGRESSION: wrong time stamp for plugin dll files on Win98(2nd)

View Bug Details




OpenJDK Bug



BugJDK-4909553 Missing doPrivileged() in sun.text.NormalizerImpl

View Bug Details




OpenJDK Bug



BugJDK-4433689 Windows95, fails to load ../jdk1.4/jre/bin/hotspot/jvm.dll

View Bug Details




OpenJDK Bug



BugDescription: BugJDK-4962201 PIT 11 : Preload failed message is displayed after j2re installation JDK-8207143 jpackager fails to parse file associations

View Bug Details




OpenJDK Bug



BugJDK-6347725 PIT Jre1.4.X autodownload test fail with an exception

View Bug Details




OpenJDK Bug



BugJDK-6915950 sun.kernel.SwingMinTest fails with UnsatisfiedLinkError. awt.dll: procedure could not be found

View Bug Details




OpenJDK Bug



BugJDK-6639529 help page does not open on installation failure

View Bug Details




OpenJDK Bug



BugDescription: BugJDK-5051865 1.3.1_12b03 JDK & JRE install errors JDK-6428573 java.exe: This application has failed to start because jli.dll was not found

View Bug Details




OpenJDK Bug



BugJDK-7166866 (TM) should be going away in license windows in EULA scenario

View Bug Details




OpenJDK Bug



BugJDK-6363986 Missing resource strings cause applet to fail.

View Bug Details




OpenJDK Bug



BugJDK-4281245 Beta : Build G : 2 jck tests failed.

View Bug Details




OpenJDK Bug



BugDescription: BugJDK-4156680 jdk117d - regression test failure: io\Serializable\Evolution\RenamePackage\insta JDK-8093714 APP_NAME-post-image.sh crash with MacPkgBundler

View Bug Details




OpenJDK Bug



BugJDK-4496923 Regression test:/java/util/Locale/InternationalBAT.java failed

View Bug Details




OpenJDK Bug



BugJDK-8095184 Firefox, Chrome: installed java is not recoginized when loading Javafx applet via DT flow

View Bug Details




OpenJDK Bug



BugJDK-8239566 gtest/GTestWrapper.java fails due to "libstlport.so.1: open failed: No such file or directory"

View Bug Details




OpenJDK Bug



BugDescription: BugJDK-6186146 Linux installation docs and RPM installation process disagree JDK-4097336 RMIFailureHandler doc comment is incorrect (so is spec)

View Bug Details




OpenJDK Bug



BugJDK-4412291 Java 2 Runtime Environment Setup Failed With a return Code of -1

View Bug Details




OpenJDK Bug



BugJDK-8127240 Windows\SysWOW64\javaws.exe from jre6 is not updated and cannot launch javafx application after insalling javafx runtime

View Bug Details




OpenJDK Bug



EnhancementJDK-4364782 Extension-Installation fails because of limitations in jar utility

View Bug Details




OpenJDK Bug



BugDescription: BugJDK-8188897 java/rmi/registry/reexport/Reexport.java failed with Port already in use JDK-6315261 REGRESSION: Lock.java is failing with 1.4.2_10-b01 and passing with 1.4.2_09-b05

View Bug Details




OpenJDK Bug



BugJDK-8159363 Swing_JTextFormattedTextField/Automated/BehaviorOnFocusLostTest fails

View Bug Details




OpenJDK Bug



BugJDK-8159358 Swing_DnD/Automated/JEP2JTFDnDTest fails as text selected in JEditorPane isn't copied to a non-empty JTextField

View Bug Details




OpenJDK Bug



BugJDK-4267941 Beta Build B : 2 thread tests failed with thread.hpp, 238 assert.

View Bug Details




OpenJDK Bug



BugDescription: BugJDK-6948712 test/java/rmi/registry/classPathCodebase/ClassPathCodebase.java fails with modules build JDK-8222098 tools/jlink/plugins/IncludeLocalesPluginTest.java time out

View Bug Details




OpenJDK Bug



BugJDK-8222100 tools/jimage/JImageTest.java time out

View Bug Details




OpenJDK Bug



BugJDK-6676757 Kernel missing javaws.jar

View Bug Details




OpenJDK Bug



BugJDK-6697660 Multiple JCK tests fails with java.lang.IllegalStateException for 6u10 b23

View Bug Details




OpenJDK Bug



BugDescription: BugJDK-8106433 dtfx.js should not automatically redirect the user to the java.com install page JDK-4453446 install fails, J2SE JRE, v 1.4.0 build 62 on German Win2000

View Bug Details




OpenJDK Bug



BugJDK-4423551 REGRESSION :Incorrect registry setting for 1.3.0_02 JRE intall

View Bug Details




OpenJDK Bug



BugJDK-8066376 There is option labeled as 'Suppress sponsors offers when installing or updating Java' under 'Miscellaneous' section.

View Bug Details




OpenJDK Bug



BugJDK-8066375 There is option labeled as 'Suppress sponsors offers when installing or updating Java' under 'Miscellaneous' section.

View Bug Details




OpenJDK Bug



BugDescription: BugJDK-4329778 Installtion of Java plugins 1.2 on Solaris 8 fails JDK-4849094 REGRESSION:Two Jaws shortcuts created when you install j2re1.4.2 and then j2re1.

View Bug Details




OpenJDK Bug



BugJDK-4262733 Hotspot 2.0:Beta:Build A : 3 JS tests failed on Win 98 with Xmixed

View Bug Details




OpenJDK Bug



BugJDK-4262721 Hotspot 2.0:Beta:Build A : 2 benchmark tests failed on Win 95 and NT with X

View Bug Details




OpenJDK Bug



BugJDK-4184211 BETA1 : BUILD_B : WIN 95 : Xcomp : Assertion failure, runtime.cpp, 1567#

View Bug Details




OpenJDK Bug



BugDescription: BugJDK-5024690 older MS products, such as VC++, can break Sun Java as default VM in IE on winxp JDK-8223194 runtime/Shutdown/ShutdownTest.java due to "OutOfMemoryError: Java heap too small"

View Bug Details




OpenJDK Bug



BugJDK-8130390 Applet fails to launch on virtual desktop

View Bug Details




OpenJDK Bug



BugJDK-4184209 BETA1 : BUILD_B : WIN 95 : Xcomp : Assertion failure, phaseX.cpp, 269#

View Bug Details




OpenJDK Bug



BugDescription: BugCODETOOLS-4730538 RegressionScript.testClassPath() returns invalid path to tools.jar JDK-4028866 WIN NT: Failed to launch hotjava on freshly-installed NT system

View Bug Details




OpenJDK Bug



BugJDK-4439908 Regression: install fails, J2SE RE 1.3.1 RC1 International on German Win2000 &ME

View Bug Details




OpenJDK Bug



BugJDK-6319835 regression test java/awt/FontClass/FontPrivilege.java fails

View Bug Details




OpenJDK Bug



EnhancementJDK-6399468 Proper error message should be thrown when the jdk/ jre installation is not successful

View Bug Details




OpenJDK Bug



BugDescription: BugJDK-4767766 Linux(32-bit): Plugin Control Panel does not work with rpm installation JDK-8022794 Can't update JDK 8 on Windows 7 64-bit

View Bug Details




OpenJDK Bug



BugJDK-4282271 Beta : Build G : 1 lang runtime test failed in -Xcomp.

View Bug Details




OpenJDK Bug



BugJDK-4281237 Beta : Build G : 1 jck test crashed with -Xcomp in assert in os_win32.cpp, 729

View Bug Details




OpenJDK Bug



BugJDK-6569156 Java Kernel not working in Vista - Component installation Error

View Bug Details




OpenJDK Bug



BugDescription: BugJDK-8164634 Registered JREs match to different 'osname' JDK-8189209 java/lang/invoke/lambda/LambdaAsm.java failed with "could not create proxy classes"

View Bug Details




OpenJDK Bug



BugJDK-6634145 Adding a JRE entry to the Javaws runtime pops up "Java Plug-in Settings Changed" dialog

View Bug Details




OpenJDK Bug



BugJDK-4338642 Optional Package test fails on Merlin build-8 and build-12 plugin

View Bug Details




OpenJDK Bug



BugJDK-8003241 Javafx applications fails to load using 7u10 co-bundle on IE browser

View Bug Details




OpenJDK Bug



BugDescription: BugJDK-4483927 startup -d64 will fail with merlin b72 JDK-6225348 JavaUpdate fails while update from one version to another on win98 only

View Bug Details




OpenJDK Bug



BugJDK-4499731 J2sdk/J2re installer for b78 can't work properly on Windows ME, 98 and 95.

View Bug Details




OpenJDK Bug



BugJDK-4698556 Problem with install of JDK(Hopper) on Win32 with insufficient disk space

View Bug Details




OpenJDK Bug



BugJDK-4217619 Netscape & Plugin on mounted file system can't find proper VM

View Bug Details




OpenJDK Bug



BugDescription: BugJDK-4809430 SUNWj3rt problem with install in S9u3 due to missing Xsever packages. JDK-8125839 Window ico files causes packaging errors

View Bug Details




OpenJDK Bug



BugJDK-4948850 com/sun/jdi/MethodEntryExitEvents.java fails on Win2003 with 1.4.1_06

View Bug Details




OpenJDK Bug



BugJDK-5054284 problems in https://java.sun.com/j2se/1.5.0/

View Bug Details




OpenJDK Bug



BugJDK-6304542 JCK 6.0: api/java_awt/geom/Area/index.html#TransformTesttestCase2[testCase2] failed, mustang, regr

View Bug Details




OpenJDK Bug



BugDescription: BugJDK-8168517 java/lang/ProcessBuilder/Basic.java failed with "java.lang.AssertionError: Some tests failed" JDK-4382526 Extension Installer Test case Failed (Build 12)

View Bug Details




OpenJDK Bug



BugJDK-8127121 Gtk: FX doesn't start on Linux when a Stage is shown without a Scene

View Bug Details




OpenJDK Bug



BugJDK-8240881 [BACKOUT] 8222489 jcmd VM.system_properties gives unusable paths on Windows

View Bug Details




OpenJDK Bug



EnhancementJDK-8133682 javapackager should have an option to include a more complete embedded JRE

View Bug Details




OpenJDK Bug



BugDescription: BugJDK-6795125 api/javax_swing/JViewport/index.html#setgetXXX JCK test fails starting from JDK 1.5.0_17b08(j4b) JDK-6562603 J2SE keyword should be removed

View Bug Details




OpenJDK Bug



BugJDK-6385277 testcase 4774166 is failing on Linux but passing on Solaris and Windows with Tiger JDKS.

View Bug Details




OpenJDK Bug



BugJDK-8163274 [TEST_BUG][macosx] apparent regression: javax/swing/JColorChooser/Test7194184.java

View Bug Details




OpenJDK Bug



BugJDK-4378551 The ladybird installation will fail at second time in linux platform.

View Bug Details




OpenJDK Bug



BugDescription: BugCODETOOLS-7901946 javadoc cannot be generated with the latest jdk9-ea build JDK-4766176 Win32: mantis JRE installation fails when there are locked files

View Bug Details




OpenJDK Bug



BugJDK-4864917 test/java/awt/font/FontNames/OldNames.java is failing sometimes on windows.

View Bug Details




OpenJDK Bug



BugJDK-4885319 PIT: awt printing in Win2k, GB18030 locale failed

View Bug Details




OpenJDK Bug



BugJDK-6429473 Nightly build for all platforms have failed

View Bug Details




OpenJDK Bug



BugDescription: BugJDK-4127510 HotSpot: Call to setlength in DataIntegrity IO test fails JDK-6831098 1 JCK test start to fail after using of tzupdater 1.3.14 b01

View Bug Details




OpenJDK Bug



BugJDK-4494375 Uninstall shield for j2re bundled in j2sdk can't work on WinodwsME

View Bug Details




OpenJDK Bug



BugJDK-4121004 Problems installing JDK and Winsock2.dll

View Bug Details




OpenJDK Bug



BugJDK-8207766 [testbug] Adapt tests for Aix.

View Bug Details




OpenJDK Bug



BugDescription: BugJDK-8235738 [macos] tools/jpackage tests timeout on macOS JDK-6737722 api/java_awt/TrayIcon/index.html#TrayIconHeadlessMode

View Bug Details




OpenJDK Bug



BugJDK-8039347 8u20 Patch Installer Failure

View Bug Details




OpenJDK Bug



BugJDK-8214582 BasicJDWPConnectionTest.java: RuntimeException: Could not detect port from ''

View Bug Details




OpenJDK Bug



BugJDK-4750479 Win32: Plugin demos fail in Netscape 6 when both NS 6 and NS 7 are installed

View Bug Details




OpenJDK Bug



BugDescription: BugJDK-8187906 Windows Registry Key Changes Omitted from JDK 9 Migration Guide JDK-4696091 Failed to download JRE/JWS with jinstall through secure proxy server

View Bug Details




OpenJDK Bug



BugJDK-4407532 java policy file is not recognised by Java Plugin Merlin build 48

View Bug Details




OpenJDK Bug



BugJDK-8211287 ClassPathTests.java fails due to "Unable to map MiscData shared space at required address."

View Bug Details




OpenJDK Bug



BugJDK-6852858 Installation of (jdk1.7.0b199) partially failed on solaris10 sparc

View Bug Details




OpenJDK Bug



BugDescription: BugJDK-6520670 1.5.0_11 installer writes wrong JavaHome value in Windows registry JDK-8226191 jpackager --license-file option broken on windows for jdk installers.

View Bug Details




OpenJDK Bug



BugJDK-4849748 REGRESSION: plugin sets Microsoft JVM version to 3802

View Bug Details




OpenJDK Bug



BugJDK-8205054 Could not find "lsof" on test machine

View Bug Details




OpenJDK Bug



BugJDK-4187269 beta1_c,-Xint,NT,K-Wiz server crashes on startup

View Bug Details




OpenJDK Bug



BugDescription: BugJDK-8168108 lib/classlist should be packaged in java.base.jmod JDK-8030950 TEST_BUG: java/rmi/registry/classPathCodebase/ClassPathCodebase.java failing intermittently

View Bug Details




OpenJDK Bug



BugJDK-8175053 Mach 5 builds failed on Windows/install repo after JDK-8173207

View Bug Details




OpenJDK Bug



BugJDK-4283624 Beta : Build G : 1 JCK AWT Swing test failed with -repeat flag.

View Bug Details




OpenJDK Bug



BugJDK-6357134 Capital letters in mime types cause errors in gnome.

View Bug Details




OpenJDK Bug



BugDescription: BugJDK-8191052 [Graal] java/lang/invoke/CallSiteTest.java intermittently fails with "Failed dependency of type call_site_target_value" when running with Graal as JIT JDK-8240711 TestJstatdPort.java failed due to "ExportException: Port already in use:"

View Bug Details




OpenJDK Bug



BugJDK-8225425 java.lang.UnsatisfiedLinkError: net.dll: Can't find dependent libraries

View Bug Details




OpenJDK Bug



BugJDK-8239569 PublicMethodsTest.java failed due to NPE in java.base/java.nio.file.FileSystems.getFileSystem(FileSystems.java:230)

View Bug Details




OpenJDK Bug



BugJDK-5042308 The Java GNOME support on Solaris should not depend on package install order.

View Bug Details




OpenJDK Bug



BugDescription: BugJDK-8166957 JRE 8u101 installation fails in SUSE 11 SP4 with error: /usr/sbin/alternatives: No such file or directory JDK-4854012 Windows i586 installation can be uninstalled using the windows ia64 bundle

View Bug Details




OpenJDK Bug



BugJDK-8032229 [TEST_BUG] The app failed automatically and it threw exception:java.lang.UnsupportedOperationException.

View Bug Details




OpenJDK Bug



BugJDK-8128706 DT- JRE7 Auto download issue

View Bug Details




OpenJDK Bug



BugJDK-4721212 Regression: test/java/util/Locale/InternationalBAT.java is failing

View Bug Details




OpenJDK Bug



BugDescription: BugJDK-6576052 Application Launch failed after Webstart driven JRE installation JDK-8020828 Incorrect jdk function call is used in jre installer

View Bug Details




OpenJDK Bug



BugJDK-6663621 JVM crashes while trying to execute api/java_security/Signature/SignatureTests.html#initSign tests.

View Bug Details




OpenJDK Bug



BugJDK-4972526 SUNWj5rt pkgadd -R fails when platform of server/client are not the same.

View Bug Details




OpenJDK Bug



BugJDK-8165298 No "Java" tab can be found in the Java Control Panel

View Bug Details




OpenJDK Bug



BugDescription: BugJDK-4360423 plugin gets loaded when disabled in control panel JDK-4205942 Java Plug-in fails to read user preference when running in NS 4.5 on Win32

View Bug Details




OpenJDK Bug



BugJDK-6360630 TESTBUG:Testcase 6218874 is looking for readme.html in jre/javaws on amd64 windows

View Bug Details




OpenJDK Bug



BugJDK-8198405 JImageExtractTest.java & JImageListTest.java failed in Windows.

View Bug Details




OpenJDK Bug



BugJDK-8214151 [TESTBUG] CleanProtectionDomain.java fails due to RuntimeException: 'protection domain unlinked' missing

View Bug Details




OpenJDK Bug



BugDescription: BugJDK-4763539 Win32: mantis SDK/JRE installer fails when there is no internet connection JDK-4511344 JCK1.4: api/javax_crypto/..., plugin, WindowsNT

View Bug Details




OpenJDK Bug



BugJDK-6795027 occasional build failure in sun.jkernel.DownloadManager.println

View Bug Details




OpenJDK Bug



BugJDK-8019246 Java Uninstall Tool loads and runs but fails to return result after 30+ minutes.

View Bug Details




OpenJDK Bug



BugJDK-8224642 Test sun/tools/jcmd/TestJcmdSanity.java fails: Bad file descriptor

View Bug Details




OpenJDK Bug



BugDescription: BugJDK-4721197 Regression: test/java/util/Locale/LocaleDataTest.java is failing. JDK-4879307 Random date/time attributes produced in jars through unpack breaks Java Update

View Bug Details




OpenJDK Bug



BugJDK-8227594 sadebugd/DebugdConnectTest.java fails due to "java.rmi.NotBoundException: SARemoteDebugger"

View Bug Details




OpenJDK Bug



BugJDK-6774258 api/java_awt/Component/index.html#PaintUpdate fails randomly

View Bug Details




OpenJDK Bug



BugJDK-6937703 java/net regression test issues with samevm

View Bug Details




OpenJDK Bug



BugDescription: BugJDK-4184206 BETA1 : BUILD_B :WIN NT & 95:Xmixed: Assertion failure, generateOopMap.cpp, 958# JDK-4531240 linux bundles should Require cp and mkdir to be installed

View Bug Details




OpenJDK Bug



BugJDK-4105248 IOException in font code prevents AWT initialization

View Bug Details




OpenJDK Bug



BugJDK-8241695 JFR TestCrossProcessStreaming.java child process exited with SIGQUIT (131)

View Bug Details




OpenJDK Bug



BugJDK-6317060 Manual Regression test 4974531 instructions need modification

View Bug Details




OpenJDK Bug



BugDescription: BugJDK-4105068 JDK 1.1.5 install tries to install wrong winsock 2 on Win98! JDK-4355034 ControlPnl dosent recognize any runtime parameters on Kest-Solaris & Kest-linux

View Bug Details




OpenJDK Bug



BugJDK-8226534 combination of windows options cause exception in MsiBundler

View Bug Details




OpenJDK Bug



BugJDK-4184210 BETA1 : BUILD_B : WIN 95 : Xcomp : Assertion failure, runtime.cpp, 1504#

View Bug Details




OpenJDK Bug



BugJDK-4184213 BETA1:BUILD_B:WIN 95 & NT:Xmixed : Assertion failure, vframeArrayOop.cpp, 168#

View Bug Details




OpenJDK Bug



EnhancementDescription: BugJDK-8191930 [Graal] emits unparseable XML into compile log JDK-4380155 serialization tests should not write files into 'test.src' directory

View Bug Details




OpenJDK Bug



BugJDK-6569133 Installing Optional Packages failing with Kernel JRE

View Bug Details




OpenJDK Bug



BugJDK-4347855 unix: Random Segmentation Violation in AWT Native Interface

View Bug Details




OpenJDK Bug



BugJDK-4137507 Problems with JDK1.2beta3 on WinNT 4.0

View Bug Details




OpenJDK Bug



BugDescription: BugJDK-8115167 Packager will no longer builder application bundle or installer on Ubuntu since b75 JDK-4191635 Beta1 : Stylepad crash

View Bug Details




OpenJDK Bug



BugJDK-8165297 No "Select Folder" button display on the dialog.

View Bug Details




OpenJDK Bug



BugJDK-4267160 Beta Build B : Javasoft Constructor test failed.

View Bug Details




OpenJDK Bug



BugJDK-8007149 Uninstall Applet failed to launch, it throws a java.io.IOException: Invalid public key

View Bug Details




OpenJDK Bug



BugDescription: BugJDK-4281233 Beta : Build G : 3 jck tests crashed with -Xcomp in assert in chaitin.hpp, 73 JDK-4468969 installer extension w/ codebase on non-default port does not work

View Bug Details




OpenJDK Bug



BugJDK-6615759 Application/Applets fails often with slow modem connection.

View Bug Details




OpenJDK Bug



BugJDK-8158210 No invalid entry associated deployment.javaws.jre.2 shows in deployment.properties.

View Bug Details




OpenJDK Bug



BugJDK-5073951 jdk1.5.0/bin/unpack200 requires GLIBC_2.2.4

View Bug Details




OpenJDK Bug



BugDescription: BugJDK-4764293 regression: test/java/awt/font/FontNames/OldNames.java fails. JDK-4780216 regression: java/awt/font/FontNames/OldNames.java fails in ja locale.

View Bug Details




OpenJDK Bug



BugJDK-8133862 Incorrect copyright year associated with the key 'NSHumanReadableCopyright' for JRE8u66

View Bug Details




OpenJDK Bug



BugJDK-6910851 Incorrect copyright info for 6u18b06 installation.

View Bug Details




OpenJDK Bug



BugJDK-5084556 Regression: Java icon isn't updated to 1.5.0_01 on Win98 only

View Bug Details




OpenJDK Bug



BugDescription: BugJDK-4702499 Linux(64): License Agreement does'nt show up in SHELL SCRIPT bundles of JDK,JRE JDK-4184208 BETA1 : BUILD_B : WIN 95 : Xmixed : Assertion failure, parse1.cpp, 422#

View Bug Details




OpenJDK Bug



BugJDK-8163583 [macosx] Press "To Back" button on the Dialog,the Dialog moves behind the Frame

View Bug Details




OpenJDK Bug



BugJDK-4650666 1.4.0_02 nightly build failed with ld: fatal: Symbol referencing errors.

View Bug Details




OpenJDK Bug



BugJDK-4181224 Regression test server/RMIClassLoader/useGetURLs/UseGetURLs.java failing

View Bug Details




OpenJDK Bug



BugDescription: BugJDK-8066384 Step 22:there is no 'javaplugin.vm.options = -Xmx256m' shown in java console. JDK-8066382 Step 22:there is no 'javaplugin.vm.options = -Xmx256m' shown in java console.

View Bug Details




OpenJDK Bug



BugJDK-8066381 Step 22:there is no 'javaplugin.vm.options = -Xmx256m' shown in java console.

View Bug Details




OpenJDK Bug



BugJDK-8066390 Step 22:there is no 'javaplugin.vm.options = -Xmx256m' shown in java console.

View Bug Details




OpenJDK Bug



BugJDK-8066389 Step 22:there is no 'javaplugin.vm.options = -Xmx256m' shown in java console.

View Bug Details




OpenJDK Bug



BugDescription: BugJDK-8066388 Step 22:there is no 'javaplugin.vm.options = -Xmx256m' shown in java console. JDK-8066386 Step 22:there is no 'javaplugin.vm.options = -Xmx256m' shown in java console.

View Bug Details




OpenJDK Bug



BugJDK-8066385 Step 22:there is no 'javaplugin.vm.options = -Xmx256m' shown in java console.

View Bug Details




OpenJDK Bug



BugJDK-6992533 JDK7 PIT: Not able to set runtime params/args using Java control panel

View Bug Details




OpenJDK Bug



BugJDK-8051972 sun/security/pkcs11/ec/ReadCertificates.java fails intermittently

View Bug Details




OpenJDK Bug



BugDescription: BugJDK-8058959 closed/java/awt/event/ComponentEvent/MovedResizedTwiceTest/MovedResizedTwiceTest.java failed automatically JDK-4091239 Sun package makes calls into provider

View Bug Details




OpenJDK Bug



BugJDK-6859935 REGRESSION: Settings are missing in JCP/Advanced tab on windows

View Bug Details




OpenJDK Bug



BugJDK-8096281 [Bundlers] LinuxRPMBundler fails to run with LICENSE_FILES param specified

View Bug Details




OpenJDK Bug



BugJDK-6229965 Testcases for CurrencyFormat and ValidateISo4217 needs to be updated for new Turkish currency

View Bug Details




OpenJDK Bug



BugDescription: BugJDK-4766039 Win32: mantis J2RE installer does not register with IE and NS6 on silent install JDK-4224008 Old version of msvcrt.dll installed by the plugin

View Bug Details




OpenJDK Bug



BugJDK-6625218 Manual and Auto java update are not working

View Bug Details




OpenJDK Bug



BugJDK-8066404 The case is failed automatically and thrown the "java.lang.IllegalStateException" exception

View Bug Details




OpenJDK Bug



BugJDK-8038944 LinuxRPMBundler fails to run with LICENSE_FILES param specified

View Bug Details




OpenJDK Bug



BugDescription: BugJDK-4288269 RC-1 : build B : One net test in JCK crashed in stress mode. JDK-4415837 Regression: lib/ext directory is not created during the first plugin install

View Bug Details




OpenJDK Bug



BugJDK-6711144 JRE offline installers pinging method=XX, oldver=NA and missing pings from online installer

View Bug Details




OpenJDK Bug



BugJDK-8206445 JImageListTest.java failed in Windows

View Bug Details




OpenJDK Bug



BugJDK-4773411 Win32: mantis installation proceeds when there is insufficient disk space

View Bug Details




OpenJDK Bug



BugDescription: BugJDK-4774392 AssertionError when loading applet using JVM-option "-esa" JDK-6209613 REGRESSION: Error during installation of SUNWj6rt package in Solaris x86/amd64

View Bug Details




OpenJDK Bug



BugJDK-4184204 BETA1 : BUILD_B : WIN NT & 95 : Xmixed : Assertion failure, connode.cpp, 125#

View Bug Details




OpenJDK Bug



BugJDK-6272402 The "About Java" dialog pops along with 2 other dialogs on Sol/Linux

View Bug Details




OpenJDK Bug



BugDescription: BugJDK-4799561 JDK 1.4 lacks provides for: jaxp_parser_impl and xml-commons-apis JDK-6868485 Issues with applets trying to access eventqueue when run with new Plug-in

View Bug Details




OpenJDK Bug



BugJDK-4203672 Java Plug-in 1.2 for NS crashes with bad EMBED tag ....

View Bug Details




OpenJDK Bug



BugJDK-5101590 4936784 testcase is failing for 1.4.2_06-b02 on itanium2 windows 2003SE.

View Bug Details




OpenJDK Bug



BugJDK-7023056 NPE from sun.security.util.ManifestEntryVerifier.verify during Maven build

View Bug Details




OpenJDK Bug



BugDescription: BugJDK-4354091 some permission tests failed on Merlin build b-22 JDK-4185309 STD: JDB doesn't support file names with spaces

View Bug Details




OpenJDK Bug



BugJDK-8023994 Right click on the icon added to the system tray for the first time, java.lang.IllegalArgumentException thrown.

View Bug Details




OpenJDK Bug



BugJDK-4389955 Incorrect registry entry name of JRE is set in Chinese system

View Bug Details




OpenJDK Bug



BugJDK-4696907 Plugin Registry key is corrupted on dirty install of hopper over merlin. UPDATED

View Bug Details




OpenJDK Bug



BugDescription: BugJDK-4760732 Sol64: j2sdk1.4.2/lib folder overwritten during install of 64bit j2sdk sh bundle JDK-4265300 Required extensions listed in applet manifest

View Bug Details




OpenJDK Bug



BugJDK-4995299 Test bug: 4182052 CTE_REGTEST testcase fails for 1.3.1_09+

View Bug Details




OpenJDK Bug



BugJDK-8123249 BrickBreaker & BouncingBalls samples are not visible after the launch

View Bug Details




OpenJDK Bug



BugJDK-7022938 New Java Plug-in occasionally fails to load first applet of two on IE 6

View Bug Details




OpenJDK Bug



BugDescription: BugJDK-4203624 Java Plug-in for NS on WIn32 should read IE proxy setting if fails. JDK-4734690 Java Plug-in 1.1.3_007 Control Panel Not Starting on WinNT

View Bug Details




OpenJDK Bug



BugJDK-4850134 Document 16-bit display system req. for Solaris x86, as mentioned in 4848272

View Bug Details




OpenJDK Bug



BugJDK-6343024 NullPointerException while trying to launch/import a "component extension"

View Bug Details




OpenJDK Bug



BugJDK-8119010 Unable to launch JavaFX 8 sample via invoking the application jar file directly

View Bug Details




OpenJDK Bug



EnhancementDescription: BugJDK-5048196 installation documentation fails to mention multiple JREs in typical JDK install JDK-4162150 Regression test EmbeddedFrame/Xm failing on solaris with JDK1.2fcs-C .

View Bug Details




OpenJDK Bug



BugJDK-4963822 java -esa -version fails on solaris sparc 2.9 with 1.4.2 packages

View Bug Details




OpenJDK Bug



BugJDK-4874819 S1AS 7 regression with tiger b07

View Bug Details




OpenJDK Bug



BugJDK-6779953 api/org_omg/PortableInterceptor/ServerRequestInfo/index.html#SIMethods test fails randomly for 6u12

View Bug Details




OpenJDK Bug



BugDescription: BugJDK-4214617 Install fails on Win98 machines JDK-6866804 (file) Path calls checkPermission insteadof checkXXX (sol)

View Bug Details




OpenJDK Bug



BugJDK-4963617 getNumGlyphs() for Type1 font may cause crash

View Bug Details




OpenJDK Bug



BugJDK-4267158 Beta Build B : Few jit tests crashed with hotspot exception.

View Bug Details




OpenJDK Bug



BugJDK-4635483 Problem with scripts of SUNWj*rt, SUNWj3rt and SUNWj*dev in S8u7/S9.

View Bug Details




OpenJDK Bug



BugDescription: BugJDK-4789571 Mantis Uninstallation fails on NT SP6 with system files locked message. JDK-4255323 hotsparc installation script for 1.0.1

View Bug Details




OpenJDK Bug



BugJDK-4789572 javax.rmi.PRO tests throwing java.lang.IllegalThreadStateException

View Bug Details




OpenJDK Bug



BugJDK-8158206 [TEST_BUG]Unable to launch "Java Runtime Environment Settings" dialog

View Bug Details




OpenJDK Bug



BugJDK-4115848 HotSpot:W95&NT: JVM cannot read compressed class.zip file

View Bug Details




OpenJDK Bug



BugDescription: BugJDK-4184212 BETA1 : BUILD_B : WIN 95 & NT : Xcomp : Assertion failure, runtime.cpp, 1773# JDK-4406151 JComboBox.setPopupVisible method throws ClassCastException exception

View Bug Details




OpenJDK Bug



BugJDK-8117940 javaws.exe crashed when launching the javafx sample app frm the html page

View Bug Details




OpenJDK Bug



BugJDK-6684104 Applets fails to launch using ImageIO if .java.policy with File permissions present on the system

View Bug Details




OpenJDK Bug



BugJDK-8143952 JShell: space in class path causes remote launch failure

View Bug Details




OpenJDK Bug



BugDescription: BugJDK-4173139 alpha2_O,-Xmixed, Windows NT,Tonga JCK test failures JDK-6646600 Group Policy Assigned JRE 1.6.0_03 uninstalls itself when sysprep.exe is run

View Bug Details




OpenJDK Bug



BugJDK-8006122 deployjava.js fails to identify Java has been installed.

View Bug Details




OpenJDK Bug



BugJDK-8094152 JSObject.call leaks out from JNI memory in 1.8

View Bug Details




OpenJDK Bug



BugJDK-8209878 Silent install fails with error 1603 due to incorrect "INSTALLDIR" parameter

View Bug Details




OpenJDK Bug



BugDescription: BugJDK-8193116 Using -BsystemWide=true flag causes error -10810 when building on the MacOSX in non-GUI mode JDK-8157554 JRE 8u92 installation in Windows Server 2012 R2 failed with error 1603

View Bug Details




OpenJDK Bug



BugJDK-8005037 Netsight network management tool not working with Java 7u9

View Bug Details




OpenJDK Bug



BugJDK-8195082 Deploying JRE.exe via SCCM fails

View Bug Details




OpenJDK Bug



BugJDK-8097231 [Crash] jvm crash using instrument agent on custom classes using javafx code under linux

View Bug Details




OpenJDK Bug



BugDescription: BugJDK-8055863 JRE 7u67 install failure with error "Object Already Exists" JDK-8238206 Uninstall verification fails due to msiexec exiting before app is uninstall

View Bug Details




OpenJDK Bug



BugJDK-8168067 JRE Installation Fails Silently on both 32-bit and 64-bit (Windows 10)

View Bug Details




OpenJDK Bug



BugJDK-8021376 Online & Offline installations fail

View Bug Details




OpenJDK Bug



BugJDK-8222801 Getting InvalidKeyException in JDK11 using NSS for SunPKCS11 TLS12

View Bug Details




OpenJDK Bug



BugDescription: BugJDK-8034221 Regression test javax/swing/JComboBox/8015300/Test8015300.java often fails JDK-8197542 Java install fails in Windows XP SP3

View Bug Details




OpenJDK Bug



BugJDK-8140205 Java SE Runtime 8u60 fails to install on Windows 7, 32-bit

View Bug Details




OpenJDK Bug



BugJDK-8208134 Unable to install or update Java, fails to create/write LocalLow\Oracle folder

View Bug Details




OpenJDK Bug



BugJDK-6205814 Java 1.4.2_06b03 install fails: System Administrator Has Set Policies to Prevent

View Bug Details




OpenJDK Bug



BugDescription: BugJDK-8043250 REGRESSION:IE 11 and FF 28 fail to recognize that Java plugin has been installed JDK-8067675 Java installer failed to connect to networking when browser and other apps can connect network

View Bug Details




OpenJDK Bug



BugJDK-4975570 java install fails if insufficient space on C:

View Bug Details




OpenJDK Bug



BugJDK-7112434 Java SDK 7 fails to install on Linux PowerPC 32bit

View Bug Details




OpenJDK Bug



BugJDK-8115091 JDK installed in C:\Program Files (x86)\Java fails compilation

View Bug Details




OpenJDK Bug



BugDescription: BugJDK-4839608 after installation OS fails to find java, javac, etc. JDK-7005996 32 bit JDK/JRE can not be installed / java.exe -version fails on OEL6 x64

View Bug Details




OpenJDK Bug



BugJDK-4340729 plugin 1.3, security exception after installation - does not reboot first

View Bug Details




OpenJDK Bug



BugJDK-6259084 Regression test/java/awt/font/FontNames/OldNames.java fails on Solaris10-AMD64 with Mustang

View Bug Details




OpenJDK Bug



BugJDK-4918947 Win98SE with Norton AV, install JRE breaks Norton, trojan VerifierBug.class

View Bug Details




OpenJDK Bug



BugDescription: BugJDK-8179009 [macosx] Java update fails every time in MAC OS X 10.9 JDK-8032887 Insecure Java pop-up: non-admin users should not have the option to update JRE

View Bug Details




OpenJDK Bug



BugJDK-7082898 applications fail with 6u28 if JDK 7 is also installed

View Bug Details




OpenJDK Bug



BugJDK-8149087 JRE 8u71 installation failed with error 1632

View Bug Details




OpenJDK Bug



BugJDK-4908932 REGRESSION:getAvailableLocales finds only en, en_US on Windows J2RE

View Bug Details




OpenJDK Bug



BugDescription: BugJDK-8189725 Error 1603 while performing Java 8u152 MSI install JDK-8074264 Let non-admin users update java

View Bug Details




OpenJDK Bug



BugJDK-6943356 JRE/JDK 6 update 19 is "not uninstallable" when its directory has been removed

View Bug Details




OpenJDK Bug



EnhancementJDK-4620725 Should be able to install java-plugin without reinstalling entire JRE

View Bug Details




OpenJDK Bug



BugJDK-4791362 Java Update - 1.4.1_02_b1 Installtion Fails

View Bug Details




OpenJDK Bug



BugDescription: BugJDK-4180714 InstallAnyWhere throws exception in java.util.zip on 1.2b4.2 JDK-4938528 1.4.2_02 EA IFTW install does not work

View Bug Details




OpenJDK Bug



BugJDK-4504306 Forte co-bundle not installing on Windows Platforms

View Bug Details




OpenJDK Bug



BugJDK-6397598 Installer fails, needs fail-safe install or uninstall mode

View Bug Details




OpenJDK Bug



BugJDK-7009530 EOFException failure invoking pack200 on Weblogic 10.3x JARs

View Bug Details




OpenJDK Bug



BugDescription: BugJDK-5072841 Update frequency is having wrong value when installed 1.5 over 1.4.2_05 JDK-6640220 JRE update is failing when I tried to Install 6u11 over 6u10

View Bug Details




OpenJDK Bug



BugJDK-8026850 Nashorn testsuite fails to run when one uses 32-bit java on a 64-bit Windows host.

View Bug Details




OpenJDK Bug



BugJDK-8040931 [MSI] Need better messaging for MSI re-install attempts of the same GUID

View Bug Details




OpenJDK Bug



BugJDK-4286251 RC1 : Build G : 1 SS Weak Hash map test failed on WIndows NT and 95

View Bug Details




OpenJDK Bug



BugDescription: BugJDK-6892334 The final installation wizard with 'Restart my browser...' didn't pop up JDK-6770637 Testcase runs correctly on 1.5 tarball installation, but it fails on the 1.5 package installation

View Bug Details




OpenJDK Bug



BugJDK-8224711 SSL handshake error when BC provider is first in the list

View Bug Details




OpenJDK Bug



BugJDK-8044636 I keep getting automatic update notifications for Java (whatever came with XP)

View Bug Details




OpenJDK Bug



BugJDK-4274052 Java 1.3 removes control panel link in explorer when installed

View Bug Details




OpenJDK Bug



BugDescription: BugJDK-8044782 Failure in Remote install JDK-4281846 Beta : Build G : 2 SS suite tests failed with Kestrel.

View Bug Details




OpenJDK Bug



BugJDK-7037676 TEST_BUG: closed/java/util/TimeZone/CheckTzdataVersion.sh better not to use non-default package tool

View Bug Details




OpenJDK Bug



BugJDK-4849799 REGRESSION: getAvailableLocales finds only en, en_US on Windows J2RE

View Bug Details




OpenJDK Bug



BugJDK-8074270 silent install fails unless you add /L filename

View Bug Details




OpenJDK Bug



BugDescription: EnhancementJDK-6697779 Applet fails to load on 64 bit machine using 64 bit JRE JDK-6540168 Impossible to install Java6 plugin from website

View Bug Details




OpenJDK Bug



BugJDK-8033364 JDK 8 windows installer not accepting CLI options

View Bug Details




OpenJDK Bug



BugJDK-6887806 User encounters error during instalation: "Error 1330 (Invalid digital signature in data1.cab"

View Bug Details




OpenJDK Bug



BugJDK-4281824 Beta : Build G : 5 JS tests failed with StackOverFlow error with Kestrel.

View Bug Details




OpenJDK Bug



BugDescription: BugJDK-8159354 2D_ImageIOTiger/ReadThumbnailListenerTest fails JDK-6641501 DT fails to trigger Kernel installation in IE7 and Firefox when 6u3 is installed

View Bug Details




OpenJDK Bug



BugJDK-4777165 Mantis PIT 08 : Upgrade Dirty install tests fails on mantis

View Bug Details




OpenJDK Bug



BugJDK-6804070 reg test java/awt/font/LocaleTests/PLSFMetricsTest.sh fails

View Bug Details




OpenJDK Bug



BugJDK-5080686 "Allow Always" is not working when signed jnlp application is installed

View Bug Details




OpenJDK Bug



BugDescription: EnhancementJDK-4421448 JWS 1.0 ExtensionInstaller is broken on LB build 16 JDK-6324930 4766667 Testcase from regression manual workspace is expecting for higher version of jdk

View Bug Details




OpenJDK Bug



BugJDK-6941262 jmod didn't fail when installing a jdk module but its dependences haven't been installed

View Bug Details




OpenJDK Bug



BugJDK-4288182 RC1 : Build B : 2 JCK VM tests crash with assert in os_win32.cpp. 729

View Bug Details




OpenJDK Bug



BugJDK-6300713 JCK6.0: vm/cldc/typechecker/rules/rules003/rules00301m10/rules00301m10.html fails

View Bug Details




OpenJDK Bug



BugDescription: BugJDK-4267161 Beta Build B : Javasoft Modtests test failed. JDK-6945166 Launching a JWS application fails if the extension installer has no codebase

View Bug Details




OpenJDK Bug



BugJDK-7064295 AU is being upgraded properly, but the log in MSI*.log says old AU removal failed.

View Bug Details




OpenJDK Bug



BugJDK-4281826 Beta : Build G : 1 JS BigDecimal test failed with Kestrel in all modes.

View Bug Details




OpenJDK Bug



BugJDK-8145729 Silent Installation with MSI Enterprise Installer fails on some systems

View Bug Details




OpenJDK Bug



BugDescription: BugJDK-4966488 Silent install does not accept spaces in install directory path JDK-8003350 javac -target does not work without -source

View Bug Details




OpenJDK Bug



BugJDK-4449782 Jaws fails to load applications with some JREs; b16

View Bug Details




OpenJDK Bug



BugJDK-6643391 JDI Demo: Trace.java doesn't pick up classpath correctly

View Bug Details




OpenJDK Bug



BugJDK-6892331 "Java Console" is not showed in File in Use dialog.

View Bug Details




OpenJDK Bug



BugDescription: BugJDK-6644869 Plugin2: Features related to old releases e.g. 5UR should be restored once 6u10 is removed JDK-4937383 1.4.2_02: De and It: Errors during installation

View Bug Details




OpenJDK Bug



BugJDK-7138658 MODULE_MODE: java.nio.file.ProviderNotFoundException: Provider "jar" not found

View Bug Details




OpenJDK Bug



EnhancementJDK-7031914 When jnlp file requests unsupported version, AutoDL attempts to donwload it instead of error dialog.

View Bug Details




OpenJDK Bug



BugJDK-4215574 Tonga Test for Cricket on Windows NT 4.0 fails with Arithmetic Exception

View Bug Details




OpenJDK Bug



BugDescription: BugJDK-8153833 NoClassDefFoundError leads to message "A JNI error has occurred" JDK-4470355 Reinstallation of JRE 1.3 via JWS does not work

View Bug Details




OpenJDK Bug



BugJDK-6231811 win32: spcjvm98 installation fails on winxp32 sp2

View Bug Details




OpenJDK Bug



BugJDK-4437757 Multi JRE support fails in Netscape on Windows

View Bug Details




OpenJDK Bug



BugJDK-6567431 Failure to handle Proxy AutoConfiguration proxy.pac

View Bug Details




OpenJDK Bug



BugDescription: BugJDK-4252673 1.0.1 : EA : Abtech demo hangs. JDK-8044104 getClass().getResource(path) returns null in Applet running from file system

View Bug Details




OpenJDK Bug



BugJDK-6648679 Avira AntiVir may be interferring with our JRE installer

View Bug Details




OpenJDK Bug



BugJDK-4782726 WinNT-4 : mantis installer unable to download windows installer 2.0.

View Bug Details




OpenJDK Bug



BugJDK-4483141 Plugin fails to run the demos applets

View Bug Details




OpenJDK Bug



BugDescription: BugJDK-6898702 REGRESSION: Failed to recover corrupted cache entry JDK-4411158 HTTPS Support Test throw sun.io.MalformedInputException on ja_JP.UTF8 locale

View Bug Details




OpenJDK Bug



BugJDK-8144085 Exceptions are seen while loading applets in Win7/Vista platforms

View Bug Details




OpenJDK Bug



BugJDK-4691510 COMPATIBILITY: Mandelbrot applet throws java.lang.IllegalArgumentException

View Bug Details




OpenJDK Bug



BugJDK-4906386 Appserver7 UR1 can not start with Tiger b15

View Bug Details




OpenJDK Bug



BugDescription: BugJDK-4656487 Java Plug-in 1.4.0 FCS Failed to load arcadeoutpost (Game) applet JDK-6357210 installation failure: can't find the msi package

View Bug Details




OpenJDK Bug



BugJDK-4373413 Reliability test failed: Failed to run on Japanese locale and win32

View Bug Details




OpenJDK Bug



BugJDK-4494659 Synthesizer.getDefaultSoundbank() returns null

View Bug Details




OpenJDK Bug



BugJDK-6529523 Privelege Check(TZupdater-V fail with no privileges-even though read should be possible.-u fail also

View Bug Details




OpenJDK Bug



BugDescription: BugJDK-6436521 3 sound regression tests fail with javax.sound.midi.MidiUnavailableException in b84 JDK-6583052 JDK RPM install uses non-standard version scheme

View Bug Details




OpenJDK Bug



BugJDK-8062278 Step 8:deployment.javaws .jre.1.osname=Linux and deployment.javaws .jre.2.osname=Windows

View Bug Details




OpenJDK Bug



BugJDK-8134667 Issues with 32 bit appBundler

View Bug Details




OpenJDK Bug



BugJDK-8171351 Failure to authenticate with http/https internet proxy correctly

View Bug Details




OpenJDK Bug



BugDescription: BugJDK-4147127 AccessControlException when running Java 3D applets with appletviewer JDK-7169556 Loading library failed: jdic_linux_amd64 AND tray_linux_amd64

View Bug Details




OpenJDK Bug



BugJDK-8050468 Demos failing when run from local file system

View Bug Details




OpenJDK Bug



BugJDK-8095587 JavaFX launcher .exe doesn't work properly when trying to use the Current JRE instead of an embedded one.

View Bug Details




OpenJDK Bug



BugJDK-6940908 Webstart client does not download required resources after making custom JRE installation

View Bug Details




OpenJDK Bug



BugDescription: BugJDK-6972009 6u22 b01 is built without 6u21 as one of the base image JDK-6260100 Applet tag support do not work properly on Mozilla family

View Bug Details




OpenJDK Bug



BugJDK-6613488 Auto-update of Java SE 6.0 update 3 fails

View Bug Details




OpenJDK Bug



BugJDK-6462935 Java Runtime Error while loading aplet

View Bug Details




OpenJDK Bug



BugJDK-8115748 DTFX-64-bit flow: JavaFX Setup failed to run- Unable to detect existing 64-bit JRE 7

View Bug Details




OpenJDK Bug



BugDescription: BugJDK-8120126 b104 introduces new error JDK-8136912 The applets can not be loaded fine and the java console can not shown up.

View Bug Details




OpenJDK Bug



BugJDK-8020682 Parameters not getting passed to MsiExec.exe on WinXP using Runtime.exec

View Bug Details




OpenJDK Bug



BugJMC-6653 JMC fails to start with Error: could not find libjava.dylib Failed to GetJREPath

View Bug Details




OpenJDK Bug



BugJDK-8133868 MacOS: 7u9 JRE proposes autoupdate to 7u10, not to 8u51

View Bug Details




OpenJDK Bug



BugDescription: BugJDK-4345718 Cookie support test fails on Merlin Build 18 JDK-4980603 JDK installation does not auto-detect JARs in /lib/ext

View Bug Details




OpenJDK Bug



BugJDK-7120467 RMI server bind issue

View Bug Details




OpenJDK Bug



BugJDK-8058951 [TEST_BUG] Minimize all the three frame windows,the Icons are overlapped.

View Bug Details




OpenJDK Bug



BugJDK-8133201 At step 9:There's no dialog with "run with latest version of JRE" shown up.

View Bug Details




OpenJDK Bug



BugDescription: BugJDK-6566958 Reg: Launching an application using offline option gives error JDK-8138767 Frame#getIconImage returns null after setIconImage(not null image) for frames inside SWT Shell container

View Bug Details




OpenJDK Bug



BugJDK-6872478 api/java_awt/geom/GeneralPath/indexTGF.html#FillHugePolyTests needs lot of mem with ConcMarkSweepGC

View Bug Details




OpenJDK Bug



BugJDK-4474744 Bea server can not accept request after starting up

View Bug Details




OpenJDK Bug



BugJDK-4235689 Shared file count not updated properly.

View Bug Details




OpenJDK Bug



BugDescription: BugJDK-4676676 NPE exception throw and lines drop with graphic intensive complicated drawings JDK-6402853 Regression: java/awt/font/LocaleTests/PLSFMetricsTest fails

View Bug Details




OpenJDK Bug



BugJDK-4742243 Some RSA test cases FAIL on 1.3.1_05b1/b2

View Bug Details




OpenJDK Bug



BugJDK-4930663 Deployment Properties shows incorrect values when retreived or dumped in console

View Bug Details




OpenJDK Bug



BugJDK-4903591 java.net.SocketException: socket write error (code=10004)

View Bug Details




OpenJDK Bug



BugDescription: BugJDK-8135141 [macosx] After clicking on the scrollbar,the case is crashed JDK-4425875 JSobject test cases are failing on NS6 using Merlin B54

View Bug Details




OpenJDK Bug



BugJDK-6944509 TEST_BUG: jigsaw shell tests fail due gawk dependancy

View Bug Details




OpenJDK Bug



BugJDK-4267936 Beta Build B : 2 graph tests failed with os_win32.cpp, 717 assert.

View Bug Details




OpenJDK Bug



BugJDK-4219700 AppletAttacks Scenerio - GetResourceTest failed with Java Plug-in 1.2.1 K build

View Bug Details




OpenJDK Bug



BugDescription: BugJDK-6369497 java.net.InetAddress.getByName("0") is throwing UnknownHostException on SLES9 with 142_XX JDK-4445812 ORB.init() throws SecurityException when custom SecurityManager is installed.

View Bug Details




OpenJDK Bug



BugJDK-8065692 RegisterDeploy() having issues with 8u20+

View Bug Details




OpenJDK Bug



BugJDK-4268974 Beta : Build B: 1 JS test failed with assert in space.cpp, 738

View Bug Details




OpenJDK Bug



BugJDK-8046300 Auto Update Fail when java.policy file is modified

View Bug Details




OpenJDK Bug



BugDescription: BugJMC-6433 JMC on Mac fails to start trying to use non-system java with "No Java runtime present, requesting install." JDK-8202138 update-alternatives attributes javaws as a slave to 2 master

View Bug Details




OpenJDK Bug



BugJDK-8007534 java/awt/font/FontNames/OldNames.java failed on solaris 10 x86, x86_64

View Bug Details




OpenJDK Bug



BugJDK-8164089 Java update and custom location issues

View Bug Details




OpenJDK Bug



BugJDK-8169569 TEST_BUG: tests under java/rmi/activation/** failed due to "timeout creating child process"

View Bug Details




OpenJDK Bug



BugDescription: BugJDK-8173618 JRE 8u121 fails to install in Windows 10 (b1607) with error 1603 JDK-8160939 TrueType Fonts that use a CJK CMAP encoding are broken by 8008386.

View Bug Details




OpenJDK Bug



EnhancementJDK-8024080 Rollback support for JDK msi

View Bug Details




OpenJDK Bug



BugJDK-8226192 sun/security/tools/jarsigner/PassType.java failed due to "Failed to exec spawn helper"

View Bug Details




OpenJDK Bug



BugJDK-8226773 misc tests are failing due to "IOException: Invalid JMOD file"

View Bug Details




OpenJDK Bug



BugDescription: BugJDK-8239089 LargeCopyWithMark.java failed due to OutOfMemoryError JDK-8198923 NoClassDefFoundError: Could not initialize Charset$ExtendedProviderHolder in 2d tests

View Bug Details




OpenJDK Bug



BugJDK-6928707 Consolidate error message reporting when install fails

View Bug Details




OpenJDK Bug



BugJDK-8235780 jdk/jshell/FailOverExecutionControlDyingLaunchTest.java fails during setup

View Bug Details




OpenJDK Bug



BugJDK-8235839 jdk/jshell/UserJdiUserRemoteTest.java fails during setup

View Bug Details




OpenJDK Bug



BugDescription: EnhancementJDK-8240349 jlink --vm with not present VM does not fail fast JDK-6948263 Successfully installed message coming when 64 bit jdk installation failed on 32 bit unix platform

View Bug Details




OpenJDK Bug



BugJDK-8207166 langtools/jdk/jshell/JdiHangingLaunchExecutionControlTest.java

View Bug Details




OpenJDK Bug



BugJDK-7145847 Unstable regression test TestDialogTypeAhead

View Bug Details




OpenJDK Bug



BugJDK-4838770 (prefs) Requirement to install JVM as root not documented

View Bug Details




OpenJDK Bug



BugDescription: BugJDK-8137033 Verify Applet and Java Control Panel display different JRE versions (8u60 and 7u51) JDK-7050995 NPE in javax.swing.text.html.StyleSheet.getRule

View Bug Details




OpenJDK Bug



BugJDK-8163086 The case automatically failed, due to the java.lang.RuntimeException

View Bug Details




OpenJDK Bug



BugJDK-7180332 [macosx]IllegalArgumentException when finish entering characters in JTree.

View Bug Details




OpenJDK Bug



BugJDK-8219641 java/awt/font/Rotate/RotatedTextTest.java fails on linux x86_64: Test failed for angle 15.0

View Bug Details




OpenJDK Bug



BugDescription: BugJDK-4346284 VM with -Xbootclasspath should fail gracefully when DISPLAY variable not set JDK-8169825 java/util/prefs/AddNodeChangeListener.java failed intermittently

View Bug Details




OpenJDK Bug



BugJDK-8160071 ClientJSSEServerJSSE.java test failure

View Bug Details




OpenJDK Bug



BugJDK-8204688 Confusing NPE on linux-x64 when no fonts are installed

View Bug Details




OpenJDK Bug



BugJDK-8035143 javax/management/remote/mandatory/notif/NotificationEmissionTest.java fails intermittently

View Bug Details




OpenJDK Bug



BugDescription: BugJDK-8222455 JavaFX error loading glass.dll from cache JDK-8241159 JMXStartStopTest.java failed due to "java.rmi.NoSuchObjectException: no such object in table"

View Bug Details




OpenJDK Bug



BugJDK-8242388 compiler/graalunit/CoreTest.java timed out

View Bug Details




OpenJDK Bug



BugJDK-8078244 Encryption README file needs updating because it is misleading

View Bug Details




OpenJDK Bug



BugJDK-8222445 [AOT] java/lang/invoke/VarHandles/VarHandleTestByteArrayAsShort.java times out

View Bug Details




OpenJDK Bug



BugDescription: BugJDK-8239567 TimeoutInErrorHandlingTest.java failed due to incomplete hs_err_pid JDK-6856436 api/javax_print/interactive/PrintServiceTests.html#PrintServiceTest can not print the text in case

View Bug Details




OpenJDK Bug



BugJDK-8229332 RmiSslBootstrapTest.sh failed due to "exit code 139"

View Bug Details




OpenJDK Bug



EnhancementJDK-4900150 Use Unicode API on in the area other than AWT

View Bug Details




OpenJDK Bug



EnhancementJDK-8155858 Investigate how to run regression tests with deprivileged modules with exploded image

View Bug Details




OpenJDK Bug



BugDescription: BugJDK-8234057 runtime/ErrorHandling/NestedThreadsListHandleInErrorHandlingTest.java failed with hs_err_pid file incomplete (first missing pattern: 2) JDK-8244213 [Graal] api/java_lang/Math/FusedMultiplyAddTests.html fails in -Xcomp

View Bug Details




OpenJDK Bug



BugJDK-8234097 java/io/File/SetLastModified.java timed out after JDK-8229333

View Bug Details




OpenJDK Bug



BugJDK-8237048 runtime/NMT/MallocRoundingReportTest.java fails on Ubuntu

View Bug Details




OpenJDK Bug



BugJDK-8020683 Java RE 7 appears in A/R but on-line test fails, install abort, 'removal'? fails

View Bug Details




OpenJDK Bug



BugDescription: BugJDK-6591706 installation failed on Java 6 on Vista JDK-4628723 .java_wrapper fails if installed in a path that includes a space.

View Bug Details




OpenJDK Bug



BugJDK-7030988 java/awt/FontClass/NegativeAngleTest/NegativeAngleTest.java failed on Hebrew installed OEL6

View Bug Details




OpenJDK Bug



BugJDK-8071973 Java SE 8 fails to understand INSTALL_DIR parameter in config file

View Bug Details




OpenJDK Bug



BugJDK-8026351 Java installation failed and users recommended to contact the software manufacturer

View Bug Details




OpenJDK Bug



BugDescription: BugJDK-6714370 Java applications failed with J2SDK 1.4.2_17 installed from packages on S10U5 JDK-4980607 Java installation straingly fails - Former networkdrive letter as a cause

View Bug Details




OpenJDK Bug



BugJDK-8044784 Java update fails when JCA providers are registered post-install

View Bug Details




OpenJDK Bug



BugJDK-8169010 MSI installer fails to install JRE 8u25 in Java Control Panel

View Bug Details




OpenJDK Bug



BugJDK-6975495 Java fails to install via RPM to non-default directory

View Bug Details




OpenJDK Bug



BugDescription: BugJDK-6383884 win98 only un-installing jre1.6 leaving control-panel open java -version fails JDK-7042296 Silent Installations Break Java Installation

View Bug Details




OpenJDK Bug



BugJDK-8006260 Issues on Java detection tool that are happening after upgrade to 7u11

View Bug Details




OpenJDK Bug



EnhancementJDK-6410605 (process) Vista: Runtime.exec does not prompt when programs need elevated privileges

View Bug Details




OpenJDK Bug



BugJDK-8022550 7u25 Installer fails, 7u25 tries to uninstall previous version and fails, MSI not found

View Bug Details




OpenJDK Bug



BugDescription: BugJDK-8235482 [TESTBUG] PackageType LINUX_RPM should be excluded for jpackage tests on debian systems JDK-6625534 Firefox on Vista, 6u3 on-line XPI installer fails with error -203

View Bug Details




OpenJDK Bug



BugJDK-6930356 Install/Uninstall of Auto Updater records Removal failed message in the install logs

View Bug Details




OpenJDK Bug



BugJDK-8013518 REGRESSION:detection logic failed to find javaws

View Bug Details




OpenJDK Bug



BugJDK-8011811 7u21 update fails with 'files could not be downloaded' when user not an admin after entering password at UAC prompt

View Bug Details




OpenJDK Bug



BugDescription: BugJDK-6452817 Mozilla/Firefox : Undesired applet behavior with mutli JRE installed on the system JDK-4966341 Threads6 VM testcase fails on RHEL3 for 1.3.1

View Bug Details




OpenJDK Bug



BugJDK-8202960 "Bundler "EXE Installer" (exe) failed" when spaces used in app name

View Bug Details




OpenJDK Bug



BugJDK-4815023 GET fails after preceding GET succeeds

View Bug Details




OpenJDK Bug



BugJDK-8125217 DT cannot download 6u35 with javafx: 2.2+ and jvm: 1.6.*

View Bug Details




OpenJDK Bug



BugDescription: BugJDK-8032624 JRE 7u51 Installer cannot proceed with current Internet Connection settings JDK-4807069 disk space check not correct in 1.4.1_01 for unpacking files

View Bug Details




OpenJDK Bug



BugJDK-6333321 REGRESSION: Java causing installation failure of BEA Weblogic Server 8.1 SP4.

View Bug Details




OpenJDK Bug



EnhancementJDK-6899788 DownloadFailure() call should pass in correct error message

View Bug Details




OpenJDK Bug



BugJDK-4429478 Possible problem with installer for HotSpot Server VM 2.0 for Win32

View Bug Details




OpenJDK Bug



BugDescription: EnhancementJDK-6730649 vista: 6u6 windows 64-bit jre installer failed on 64-bit machine while run as non built-in admin. JDK-8030006 [Mac OSX] JavaAppLauncher doesn't warn if Java is missing

View Bug Details




OpenJDK Bug



BugJDK-6892322 'Restart my browser........' checkbox doesn't show

View Bug Details




OpenJDK Bug



BugJDK-6903525 Very poor user experience when installing 6u17 on Windows 7 x64

View Bug Details




OpenJDK Bug



BugJDK-4969817 1.4.1_07: around 70 jck tests fail if you use -d64 and -Xcomp flags together

View Bug Details




OpenJDK Bug



BugDescription: BugJDK-8138710 java.com verify page does not recognize jre 8u101 after installation JDK-8243056 msi REINSTALL=ALL REINSTALLMODE=omus throws Error:could not find java.dll

View Bug Details




OpenJDK Bug



BugJDK-7175170 Deployment via group policy using either the msi file or the exe,install fails

View Bug Details




OpenJDK Bug



BugJDK-6399429 jre is installing in default c:/ drive instead of OS directory for 131_XX for all windows.

View Bug Details




OpenJDK Bug



BugJDK-4311941 Classic VM : RC1 build U : JTREG Regression test crashes in classic VM

View Bug Details




OpenJDK Bug



BugDescription: EnhancementJDK-8020668 [macosx] PreferencePanes link not created during install JDK-7018027 On-line installer fails if FPUpdater tool has been run on JRE, installer should not fail.

View Bug Details




OpenJDK Bug



BugJDK-8061640 Cannot update using runas

View Bug Details




OpenJDK Bug



BugJDK-6914139 JRE 1.6.0.17-b04 installation failed while choosing different (custom) location

View Bug Details




OpenJDK Bug



BugJDK-6832296 x64 Ubuntu: Can't install 32-bit bundle

View Bug Details




OpenJDK Bug



BugDescription: BugJDK-6373192 Cannot install or uninstall in Windows 95 -- Error 1723 JDK-7172165 Silent install fails when launched with options

View Bug Details




OpenJDK Bug



BugJDK-8047038 Upgrading Java 8 silently as system, Java will not install if Java is in use

View Bug Details




OpenJDK Bug



BugJDK-6856086 Postremove scripts of SUNWj*rt and SUNWj*dev fail when upgrading from s28hw4 to s10u8_02

View Bug Details




OpenJDK Bug



BugJDK-6591702 Need to document the JDK directory structure that the installer expects

View Bug Details




OpenJDK Bug



BugDescription: EnhancementJDK-6510981 msi package deployement error "1606" when using non-interactive installation JDK-8148796 Running deployment registration one more time with disabled web java.

View Bug Details




OpenJDK Bug



BugJDK-6921894 win7 64 bit: will not install with message "windows installer"

View Bug Details




OpenJDK Bug



BugJDK-7011724 Error 26022, Unpacking charsets failed, while running iftw-k installer

View Bug Details




OpenJDK Bug



EnhancementJDK-8040929 Add "uninstall first" messaging to MSI installer for upgrading same-rev

View Bug Details




OpenJDK Bug



BugDescription: BugJDK-6636465 javadb repair fails once jdk is uninstalled

View Bug Details




JDK-8010073 Test java/awt/event/KeyEvent/QueueKeyEvent/4799136/Bug4799136.java fails since 5.0 FCS

View Bug Details




OpenJDK Bug



BugJDK-7108484 MSI installer failed to extract the binaries and installation would leave system JRE.

View Bug Details




OpenJDK Bug



BugJDK-6959679 No download to install java plug-in window appear when loading the applet Test4908596

View Bug Details




OpenJDK Bug



BugJDK-8078833 Geogebra applet can not be loaded as thrown java.net.SocketException and CouldNotLoadArgumentException - Solaris 10

View Bug Details




OpenJDK Bug



BugDescription: BugJDK-8092614 Javafx native packager fails to set the application classpath

View Bug Details




JDK-7040025 Kernel background download does not work

View Bug Details




OpenJDK Bug



BugJDK-6911368 64-bit Windows - jre CurrentVersion isn't set to the highest version number on the machine

View Bug Details




OpenJDK Bug



BugJDK-6992714 Nightly build fail on windows-i586 with fix for 6865633

View Bug Details




OpenJDK Bug



EnhancementJDK-6865633 Java SE for Business: no statistics gathering is being demanded for windows offline installer

View Bug Details




OpenJDK Bug



BugDescription: BugJDK-6539475 JRE 1.6.0 doesn't register class ids for 1.5.0_10 and 1.5.0_11

View Bug Details




JDK-8080269 There is java.lang.IllegalMonitorStateException thrown in the java console, when clicking "X" close button

View Bug Details




OpenJDK Bug



BugJDK-8044344 JRE 7u55 Deployment Rule Set cannot find the installed JRE 6

View Bug Details




OpenJDK Bug



BugJDK-6831370 JRE Installation Failed leves the files in a half way - Bad User experience.

View Bug Details




OpenJDK Bug



BugJDK-6308584 java/demo Error Message thrown for /demo/jfc/Java2D and /demo/plugin/jfc/Java2D in appletSave

View Bug Details




OpenJDK Bug



BugDescription: BugJDK-4268930 Beta : Build B: java_g -XX:+UseStackBanging -version fails with assert.

View Bug Details




JDK-8051356 JRE 7u65 (64 bit) failed to deploy completely on Windows 7 (64 bit) system

View Bug Details




OpenJDK Bug



BugJDK-8138660 PIT: Applet fails to load sometimes by throwing NumberFormatException

View Bug Details




OpenJDK Bug



BackportJDK-2190697 InetAddress.getByName behaves differently on Windows

View Bug Details




OpenJDK Bug



BugJDK-8057118 After install, Checkpoint VPN(certificate) capability is destroyed.

View Bug Details




OpenJDK Bug



BugDescription: BugJDK-4644936 INTERNAL APPLETS:Java Plug-in 1.4.0 FCS Failed to load "JavaCart" applet

View Bug Details




JDK-6308262 java.home, java.runtime.version pointing to old jre values even after browser jre is changed

View Bug Details




OpenJDK Bug



BugJDK-4320883 JRE 1.2.2 Setup extracts 3 .jar files in SRCDIR, should be SUPPORTDIR

View Bug Details




OpenJDK Bug



BugJDK-8147921 TestZipFile failed with java.lang.AssertionError exception

View Bug Details




OpenJDK Bug



EnhancementJDK-4821316 J2SE SDK installation makes two copies of the JRE

View Bug Details




OpenJDK Bug



EnhancementDescription: BugJDK-4193212 oldjava not included in JRE JDK-5100125 Error 1320: the specified path is too long t:\j2sdk-15

View Bug Details




OpenJDK Bug



BugJDK-8055950 AWT_Desktop/Manual/BasicTest crashed.

View Bug Details




OpenJDK Bug



BugJDK-8202188 SunX509 trust manager may choose wrong signature algorithm

View Bug Details




OpenJDK Bug



BugJDK-4904545 JDK tools fail to work with non-latin characters in the install path

View Bug Details




OpenJDK Bug



BugDescription: BugJDK-6317398 error message displayed on terminal when application selected from java cache viewer JDK-8010061 Test java/awt/Dialog/4255200/ModalTest.java fails since 5.0 FCS

View Bug Details




OpenJDK Bug



EnhancementJDK-7165545 JRE installer need to reset or offer to reset .jar association (if needed)

View Bug Details




OpenJDK Bug



EnhancementJDK-8163356 Improve linux native launcher's jre detection

View Bug Details




OpenJDK Bug



BugJDK-4644904 Java Plug-in 1.4.0 FCS Failed to load Java Applet Gallery-Voxel Applet

View Bug Details




OpenJDK Bug



BugJDK-4689929 COMPATIBILITY: Applet fails to load and throws exceptions in console

View Bug Details




OpenJDK Bug



BugJDK-6814052 Kernel Bundles fails to download due to security check. 6u14b03 PIT.

View Bug Details




OpenJDK Bug



BugJDK-8135319 When clicking the "x" button at the right top of the browser, it throws java.lang.IllegalStateException

View Bug Details




OpenJDK Bug



BugJDK-4716945 COMPATIBILITY: hopper-rc AOL IM applet redraws incorrectly and eventually hangs

View Bug Details




OpenJDK Bug



BugJDK-6825869 JSObject fails in Firefox extensions

View Bug Details




OpenJDK Bug



BugJDK-6448795 VISTA (IE7) : Applet throws java.lang.NullPointerException on refreshing

View Bug Details




OpenJDK Bug



BugJDK-4434187 VM is still active when the IE browser is killed on Win 98 1st ed

View Bug Details




OpenJDK Bug



BugJDK-8024518 the auto download jre flow won't occur on windows, and it will not direct to the java.com on non-windows

View Bug Details




OpenJDK Bug



BugJDK-4644909 Java Plug-in 1.4.0 FCS Failed to load Gallery-Kaleidoscope Painter Applet

View Bug Details




OpenJDK Bug



BugJDK-4644897 Java Plug-in 1.4.0 FCS Failed to load Java Applet Gallery-Missle Invasion Applet

View Bug Details




OpenJDK Bug



BugJDK-6313855 Automatic update hardcoded to check space on C:

View Bug Details




OpenJDK Bug



BugJDK-6916096 2D: Three 2D_multimonitor Tests fails

View Bug Details




OpenJDK Bug



BugJDK-8185510 build failure in smartmake due to use of 'C:\cygwin\tmp\'

View Bug Details




OpenJDK Bug



BugJDK-6674794 [WAT] Java Kernel Installer pops up error dialog during the installation

View Bug Details




OpenJDK Bug



BugJDK-6547262 Running Java applet crashes IE 7 in Windows Vista Home

View Bug Details




OpenJDK Bug



BugJDK-7066724 SUNWj6rt upgrade issues if you upgrade from s10u9 to s10u10_15 or later

View Bug Details




OpenJDK Bug



BugJDK-7104760 Unable to load the JRE using the Oracle provided javascript files

View Bug Details




OpenJDK Bug



BugJDK-5019481 reset library tests fail under tonga harness on RHEL

View Bug Details




OpenJDK Bug



BugJDK-6578673 Cache: Java Web Start (bundled with JRE 6.0) Fails to convert previous caché